BDBM50337124 4-(((6-cyano-4'-fluorobiphenyl-3-yl)(4H-1,2,4-triazol-4-yl)amino)methyl)phenyl sulfamate::CHEMBL1672981
SMILES NS(=O)(=O)Oc1ccc(CN(c2ccc(C#N)c(c2)-c2ccc(F)cc2)n2cnnc2)cc1
InChI Key InChIKey=UAQOSFODGMDLAB-UHFFFAOYSA-N
Data  2 IC50
  Tab Delimited (TSV)   2D SDfile   Computed 3D by Vconf -m prep SDfile
Find this compound or compounds like it in BindingDB:
Activity Spreadsheet -- Enzyme Inhibition Constant Data from BindingDB
Found 2 hits for monomerid = 50337124
TargetSteryl-sulfatase(Homo sapiens (Human))
TBA
Curated by ChEMBL
LigandPNGBDBM50337124(4-(((6-cyano-4'-fluorobiphenyl-3-yl)(4H-1,2,4-tria...)
Affinity DataIC50:  55nM. Assay description: Inhibition of steroid sulfatase in human JEG-3 cells using [6,7-3H]E1S after 1 hr by scintillation spectrometry
In DepthDetails ArticlePubMed
TargetAromatase(Homo sapiens (Human))
TBA
Curated by ChEMBL
LigandPNGBDBM50337124(4-(((6-cyano-4'-fluorobiphenyl-3-yl)(4H-1,2,4-tria...)
Affinity DataIC50:  0.470nM. Assay description: Inhibition of aromatase in human JEG-3 cells using [1beta-3H]androstenedione after 1 hr by scintillation spectrometry
In DepthDetails ArticlePubMed