BDBM50338535 CHEMBL4162728
SMILES CC(C)C[C@H](NC(=O)[C@H](Cc1ccccc1)NC(=O)[C@@H]1Cc2ccc(O)cc2CN1C(C)=O)C(=O)N[C@@H](Cc1ccc2ccccc2c1)C(=O)N[C@@H](CCCNC(N)=N)C(=O)N1CCC[C@H]1C(=O)N[C@@H](CCCNC(N)=N)C(=O)N[C@@H](CC(N)=O)C(N)=O
InChI Key InChIKey=PQCFWBYPBFBVLC-COQAPAFSSA-N
Data  2 IC50  2 EC50
  Tab Delimited (TSV)   2D SDfile   Computed 3D by Vconf -m prep SDfile
Find this compound or compounds like it in BindingDB:
Activity Spreadsheet -- Enzyme Inhibition Constant Data from BindingDB
Found 4 hits for monomerid = 50338535
TargetNeuromedin-U receptor 1(Homo sapiens (Human))
Vrije Universiteit Brussel
Curated by ChEMBL
LigandPNGBDBM50338535(CHEMBL4162728)
Affinity DataEC50:  2.90nM. Assay description: Agonist activity at human NMUR1 expressed in HEK293 cells assessed as IP3 accumulation after 60 mins in presence of myo-[2-3H(N)]inositol by scintill...
In DepthDetails ArticlePubMed
TargetNeuromedin-U receptor 1(Homo sapiens (Human))
Vrije Universiteit Brussel
Curated by ChEMBL
LigandPNGBDBM50338535(CHEMBL4162728)
Affinity DataIC50:  0.0920nM. Assay description: Displacement of [3H]-NMU-8 from human NMUR1 expressed in HEK293 cells after 3 hrs by topcount micro scintillation counting method
In DepthDetails ArticlePubMed
TargetNeuromedin-U receptor 2(Homo sapiens (Human))
Vrije Universiteit Brussel
Curated by ChEMBL
LigandPNGBDBM50338535(CHEMBL4162728)
Affinity DataIC50:  302nM. Assay description: Displacement of [3H]-NMU-8 from human NMUR2 expressed in HEK293 cells after 3 hrs by topcount micro scintillation counting method
In DepthDetails ArticlePubMed
TargetNeuromedin-U receptor 2(Homo sapiens (Human))
Vrije Universiteit Brussel
Curated by ChEMBL
LigandPNGBDBM50338535(CHEMBL4162728)
Affinity DataEC50:  459nM. Assay description: Agonist activity at human NMUR2 expressed in HEK293 cells assessed as IP3 accumulation after 60 mins in presence of myo-[2-3H(N)]inositol by scintill...
In DepthDetails ArticlePubMed