BDBM50340738 1-(2-(4-chlorophenethylamino)-4-(pyrrolidin-1-yl)quinazolin-6-ylsulfonyl)-N-(1-(dimethylamino)propan-2-yl)piperidine-4-carboxamide::CHEMBL1762693
SMILES CC(CN(C)C)NC(=O)C1CCN(CC1)S(=O)(=O)c1ccc2nc(NCCc3ccc(Cl)cc3)nc(N3CCCC3)c2c1
InChI Key InChIKey=KZWFJJHHDKUIBN-UHFFFAOYSA-N
Data  1 IC50
  Tab Delimited (TSV)   2D SDfile   Computed 3D by Vconf -m prep SDfile
Find this compound or compounds like it in BindingDB:
Activity Spreadsheet -- Enzyme Inhibition Constant Data from BindingDB
Found 1 hit for monomerid = 50340738
TargetMas-related G-protein coupled receptor member X1(Homo sapiens (Human))
Astrazeneca R&D Montreal
Curated by ChEMBL
LigandPNGBDBM50340738(1-(2-(4-chlorophenethylamino)-4-(pyrrolidin-1-yl)q...)
Affinity DataIC50:  530nM. Assay description: Antagonist activity at SNSR4 in human HEK293 cells by FLIPR assay
In DepthDetails ArticlePubMed