BDBM50341841 (S)-tert-Butyl(8-(Hydroxyimino)-9-(methylamino)-1,9-dioxo-1-(phenylamino)nonan-2-yl)(4-methoxybenzyl)carbamate::CHEMBL1767045
SMILES CNC(=O)C(CCCCC[C@H](N(Cc1ccc(OC)cc1)C(=O)OC(C)(C)C)C(=O)Nc1ccccc1)N=O
InChI Key InChIKey=GVOVWTCGJXODRR-BBMPLOMVSA-N
Data  11 IC50
  Tab Delimited (TSV)   2D SDfile   Computed 3D by Vconf -m prep SDfile
Find this compound or compounds like it in BindingDB:
Activity Spreadsheet -- Enzyme Inhibition Constant Data from BindingDB
Found 11 hits for monomerid = 50341841
TargetHistone deacetylase 5(Homo sapiens (Human))
Universita` Degli Studi Di Siena
Curated by ChEMBL
LigandPNGBDBM50341841((S)-tert-Butyl(8-(Hydroxyimino)-9-(methylamino)-1,...)
Affinity DataIC50:  7.67E+4nM. Assay description: Inhibition of human HDAC5 using ArgHisLysLys(Ac) fluorogenic peptide as a substrate by fluorimetric assay
In DepthDetails ArticlePubMed
TargetHistone deacetylase 3(Homo sapiens (Human))
Universita` Degli Studi Di Siena
Curated by ChEMBL
LigandPNGBDBM50341841((S)-tert-Butyl(8-(Hydroxyimino)-9-(methylamino)-1,...)
Affinity DataIC50:  4.94E+4nM. Assay description: Inhibition of human HDAC3 using ArgHisLysLys(Ac) fluorogenic peptide as a substrate by fluorimetric assay
In DepthDetails ArticlePubMed
TargetHistone deacetylase 11(Homo sapiens (Human))
Universita` Degli Studi Di Siena
Curated by ChEMBL
LigandPNGBDBM50341841((S)-tert-Butyl(8-(Hydroxyimino)-9-(methylamino)-1,...)
Affinity DataIC50: >1.00E+5nM. Assay description: Inhibition of human HDAC11 using ArgHisLysLys(Ac) fluorogenic peptide as a substrate by fluorimetric assay
In DepthDetails ArticlePubMed
TargetHistone deacetylase 1(Homo sapiens (Human))
Universita` Degli Studi Di Siena
Curated by ChEMBL
LigandPNGBDBM50341841((S)-tert-Butyl(8-(Hydroxyimino)-9-(methylamino)-1,...)
Affinity DataIC50:  8.11E+4nM. Assay description: Inhibition of human HDAC1 using ArgHisLysLys(Ac) fluorogenic peptide as a substrate by fluorimetric assay
In DepthDetails ArticlePubMed
TargetHistone deacetylase 2(Homo sapiens (Human))
Universita` Degli Studi Di Siena
Curated by ChEMBL
LigandPNGBDBM50341841((S)-tert-Butyl(8-(Hydroxyimino)-9-(methylamino)-1,...)
Affinity DataIC50: >1.00E+5nM. Assay description: Inhibition of human HDAC2 using ArgHisLysLys(Ac) fluorogenic peptide as a substrate by fluorimetric assay
In DepthDetails ArticlePubMed
TargetPolyamine deacetylase HDAC10(Homo sapiens (Human))
Universita` Degli Studi Di Siena
Curated by ChEMBL
LigandPNGBDBM50341841((S)-tert-Butyl(8-(Hydroxyimino)-9-(methylamino)-1,...)
Affinity DataIC50:  9.85E+4nM. Assay description: Inhibition of human HDAC10 using ArgHisLysLys(Ac) fluorogenic peptide as a substrate by fluorimetric assay
In DepthDetails ArticlePubMed
TargetHistone deacetylase 6(Homo sapiens (Human))
Universita` Degli Studi Di Siena
Curated by ChEMBL
LigandPNGBDBM50341841((S)-tert-Butyl(8-(Hydroxyimino)-9-(methylamino)-1,...)
Affinity DataIC50:  6.42E+4nM. Assay description: Inhibition of human HDAC6 using ArgHisLysLys(Ac) fluorogenic peptide as a substrate by fluorimetric assay
In DepthDetails ArticlePubMed
TargetHistone deacetylase 7(Homo sapiens (Human))
Universita` Degli Studi Di Siena
Curated by ChEMBL
LigandPNGBDBM50341841((S)-tert-Butyl(8-(Hydroxyimino)-9-(methylamino)-1,...)
Affinity DataIC50: >1.00E+5nM. Assay description: Inhibition of human HDAC7 using ArgHisLysLys(Ac) fluorogenic peptide as a substrate by fluorimetric assay
In DepthDetails ArticlePubMed
TargetHistone deacetylase 8(Homo sapiens (Human))
Universita` Degli Studi Di Siena
Curated by ChEMBL
LigandPNGBDBM50341841((S)-tert-Butyl(8-(Hydroxyimino)-9-(methylamino)-1,...)
Affinity DataIC50: >1.00E+5nM. Assay description: Inhibition of human HDAC8 using ArgHisLysLys(Ac) fluorogenic peptide as a substrate by fluorimetric assay
In DepthDetails ArticlePubMed
TargetHistone deacetylase 9(Homo sapiens (Human))
Universita` Degli Studi Di Siena
Curated by ChEMBL
LigandPNGBDBM50341841((S)-tert-Butyl(8-(Hydroxyimino)-9-(methylamino)-1,...)
Affinity DataIC50: >1.00E+5nM. Assay description: Inhibition of human HDAC9 using ArgHisLysLys(Ac) fluorogenic peptide as a substrate by fluorimetric assay
In DepthDetails ArticlePubMed
TargetHistone deacetylase 4(Homo sapiens (Human))
Universita` Degli Studi Di Siena
Curated by ChEMBL
LigandPNGBDBM50341841((S)-tert-Butyl(8-(Hydroxyimino)-9-(methylamino)-1,...)
Affinity DataIC50: >1.00E+5nM. Assay description: Inhibition of human HDAC4 using ArgHisLysLys(Ac) fluorogenic peptide as a substrate by fluorimetric assay
In DepthDetails ArticlePubMed