BDBM50343331 CHEMBL1773480::N-(4-{4-[(Benzylmethylamino)methyl]benzoyl}phenyl)-2-morpholin-4-yl-acetamide
SMILES CN(Cc1ccccc1)Cc1ccc(cc1)C(=O)c1ccc(NC(=O)CN2CCOCC2)cc1
InChI Key InChIKey=JDOLORVWCDRHKG-UHFFFAOYSA-N
Data  2 IC50
  Tab Delimited (TSV)   2D SDfile   Computed 3D by Vconf -m prep SDfile
Find this compound or compounds like it in BindingDB:
Activity Spreadsheet -- Enzyme Inhibition Constant Data from BindingDB
Found 2 hits for monomerid = 50343331
TargetCholinesterase(Homo sapiens (Human))
University Of Bologna
Curated by ChEMBL
LigandPNGBDBM50343331(CHEMBL1773480 | N-(4-{4-[(Benzylmethylamino)methyl...)
Affinity DataIC50:  1.79E+5nM. Assay description: Inhibition of human BChE using butyrylthiocholine iodide as substrate by Ellman's method
In DepthDetails ArticlePubMed
TargetAcetylcholinesterase(Homo sapiens (Human))
University Of Bologna
Curated by ChEMBL
LigandPNGBDBM50343331(CHEMBL1773480 | N-(4-{4-[(Benzylmethylamino)methyl...)
Affinity DataIC50:  720nM. Assay description: Inhibition of human AChE using acetylthiocholine iodide as substrate by Ellman's assay
In DepthDetails ArticlePubMed