BDBM50343598 CHEMBL1774523::N-{2-[7-(3-Furyl)-1,6-dihydro-2H-indeno[5,4-b]furan-8-yl]-ethyl}acetamide
SMILES CC(=O)NCCC1=C(Cc2ccc3OCCc3c12)c1ccoc1
InChI Key InChIKey=DYJHRWOVMVZEJM-UHFFFAOYSA-N
Data  2 KI
  Tab Delimited (TSV)   2D SDfile   Computed 3D by Vconf -m prep SDfile
Find this compound or compounds like it in BindingDB:
Activity Spreadsheet -- Enzyme Inhibition Constant Data from BindingDB
Found 2 hits for monomerid = 50343598
TargetMelatonin receptor type 1A(Homo sapiens (Human))
Takeda Pharmaceutical
Curated by ChEMBL
LigandPNGBDBM50343598(CHEMBL1774523 | N-{2-[7-(3-Furyl)-1,6-dihydro-2H-i...)
Affinity DataKi:  0.00650nM. Assay description: Displacement of [125I]-2-iodomelatonin from human MT1 receptor expressed on CHO cells by microscintillation counting
In DepthDetails ArticlePubMed
TargetMelatonin receptor type 1B(Homo sapiens (Human))
Takeda Pharmaceutical
Curated by ChEMBL
LigandPNGBDBM50343598(CHEMBL1774523 | N-{2-[7-(3-Furyl)-1,6-dihydro-2H-i...)
Affinity DataKi:  0.00960nM. Assay description: Displacement of [125I]-2-iodomelatonin from human MT2 receptor expressed on CHO cells microscintillation counting
In DepthDetails ArticlePubMed