BDBM50344074 CHEMBL1777867::rac-3-(4-(5-bromopyrimidin-2-yloxy)phenyl)hex-4-ynoic acid
SMILES CC#CC(CC(O)=O)c1ccc(Oc2ncc(Br)cn2)cc1
InChI Key InChIKey=USGBHZYCIIHVDP-UHFFFAOYSA-N
Data  1 IC50  2 EC50
  Tab Delimited (TSV)   2D SDfile   Computed 3D by Vconf -m prep SDfile
Find this compound or compounds like it in BindingDB:
Activity Spreadsheet -- Enzyme Inhibition Constant Data from BindingDB
Found 3 hits for monomerid = 50344074
TargetFree fatty acid receptor 1(Homo sapiens (Human))
Merck Research Laboratories
Curated by ChEMBL
LigandPNGBDBM50344074(CHEMBL1777867 | rac-3-(4-(5-bromopyrimidin-2-yloxy...)
Affinity DataEC50:  1.57E+3nM. Assay description: Agonist activity at human GPR40 expressed in CHO cells assessed as intracellular calcium mobilization by FLIPR assay
In DepthDetails ArticlePubMed
TargetFree fatty acid receptor 1(Homo sapiens (Human))
Merck Research Laboratories
Curated by ChEMBL
LigandPNGBDBM50344074(CHEMBL1777867 | rac-3-(4-(5-bromopyrimidin-2-yloxy...)
Affinity DataIC50:  433nM. Assay description: Inhibition of human GPR40 expressed in CHO cells by SPA based binding assay
In DepthDetails ArticlePubMed
TargetFree fatty acid receptor 1(Mus musculus)
Merck Research Laboratories
Curated by ChEMBL
LigandPNGBDBM50344074(CHEMBL1777867 | rac-3-(4-(5-bromopyrimidin-2-yloxy...)
Affinity DataEC50:  1.48E+3nM. Assay description: Agonist activity at mouse GPR40 expressed in CHO cells assessed as intracellular calcium mobilization by FLIPR assay
In DepthDetails ArticlePubMed