BDBM50345239 5-(1-(piperidin-4-yl)-1H-pyrazol-4-yl)benzofuran-2-carboxylic acid::CHEMBL1782510
SMILES OC(=O)c1cc2cc(ccc2o1)-c1cnn(c1)C1CCNCC1
InChI Key InChIKey=ABHFIRYPSLUDGX-UHFFFAOYSA-N
Data  2 IC50
  Tab Delimited (TSV)   2D SDfile   Computed 3D by Vconf -m prep SDfile
Find this compound or compounds like it in BindingDB:
Activity Spreadsheet -- Enzyme Inhibition Constant Data from BindingDB
Found 2 hits for monomerid = 50345239
TargetSerine/threonine-protein kinase pim-2(Homo sapiens (Human))
Genzyme
Curated by ChEMBL
LigandPNGBDBM50345239(5-(1-(piperidin-4-yl)-1H-pyrazol-4-yl)benzofuran-2...)
Affinity DataIC50:  5.80E+3nM. Assay description: Inhibition of human Pim2 using 5-FAM-RSRHSSYPAGT-CONH2 as substrate after 90 mins by off-chip mobility shift method
In DepthDetails ArticlePubMed
TargetSerine/threonine-protein kinase pim-1(Homo sapiens (Human))
Genzyme
Curated by ChEMBL
LigandPNGBDBM50345239(5-(1-(piperidin-4-yl)-1H-pyrazol-4-yl)benzofuran-2...)
Affinity DataIC50:  6.00E+3nM. Assay description: Inhibition of human Pim1 using 5-FAM-RSRHSSYPAGT-CONH2 as substrate after 45 mins by off-chip mobility shift method
In DepthDetails ArticlePubMed