BDBM50345255 5-bromo-7-(2-(piperidin-4-yl)acetamido)benzofuran-2-carboxylic acid::CHEMBL1782526
SMILES OC(=O)c1cc2cc(Br)cc(NC(=O)CC3CCNCC3)c2o1
InChI Key InChIKey=RYSQBFTZOVSXES-UHFFFAOYSA-N
Data  2 IC50
  Tab Delimited (TSV)   2D SDfile   Computed 3D by Vconf -m prep SDfile
Find this compound or compounds like it in BindingDB:
Activity Spreadsheet -- Enzyme Inhibition Constant Data from BindingDB
Found 2 hits for monomerid = 50345255
TargetSerine/threonine-protein kinase pim-2(Homo sapiens (Human))
Genzyme
Curated by ChEMBL
LigandPNGBDBM50345255(5-bromo-7-(2-(piperidin-4-yl)acetamido)benzofuran-...)
Affinity DataIC50:  340nM. Assay description: Inhibition of human Pim2 using 5-FAM-RSRHSSYPAGT-CONH2 as substrate after 90 mins by off-chip mobility shift method
In DepthDetails ArticlePubMed
TargetSerine/threonine-protein kinase pim-1(Homo sapiens (Human))
Genzyme
Curated by ChEMBL
LigandPNGBDBM50345255(5-bromo-7-(2-(piperidin-4-yl)acetamido)benzofuran-...)
Affinity DataIC50:  55nM. Assay description: Inhibition of human Pim1 using 5-FAM-RSRHSSYPAGT-CONH2 as substrate after 45 mins by off-chip mobility shift method
In DepthDetails ArticlePubMed