BDBM50345260 CHEMBL1782531::trans-7-(4-aminocyclohexylamino)-5-bromobenzofuran-2-carboxylic acid
SMILES N[C@H]1CC[C@@H](CC1)Nc1cc(Br)cc2cc(oc12)C(O)=O
InChI Key InChIKey=BLBAWGODFTZAEY-XYPYZODXSA-N
Data  7 IC50
  Tab Delimited (TSV)   2D SDfile   Computed 3D by Vconf -m prep SDfile
Find this compound or compounds like it in BindingDB:
Activity Spreadsheet -- Enzyme Inhibition Constant Data from BindingDB
Found 7 hits for monomerid = 50345260
TargetSerine/threonine-protein kinase pim-1(Homo sapiens (Human))
Genzyme
Curated by ChEMBL
LigandPNGBDBM50345260(CHEMBL1782531 | trans-7-(4-aminocyclohexylamino)-5...)
Affinity DataIC50:  19nM. Assay description: Inhibition of human Pim1 using 5-FAM-RSRHSSYPAGT-CONH2 as substrate after 45 mins by off-chip mobility shift method
In DepthDetails ArticlePubMed
TargetSerine/threonine-protein kinase pim-2(Homo sapiens (Human))
Genzyme
Curated by ChEMBL
LigandPNGBDBM50345260(CHEMBL1782531 | trans-7-(4-aminocyclohexylamino)-5...)
Affinity DataIC50:  66nM. Assay description: Inhibition of human Pim2 using 5-FAM-RSRHSSYPAGT-CONH2 as substrate after 90 mins by off-chip mobility shift method
In DepthDetails ArticlePubMed
TargetCytochrome P450 1A2(Homo sapiens (Human))
Genzyme
Curated by ChEMBL
LigandPNGBDBM50345260(CHEMBL1782531 | trans-7-(4-aminocyclohexylamino)-5...)
Affinity DataIC50: >1.00E+4nM. Assay description: Inhibition of CYP1A2 in human liver microsomes
In DepthDetails ArticlePubMed
TargetCytochrome P450 3A4(Homo sapiens (Human))
Genzyme
Curated by ChEMBL
LigandPNGBDBM50345260(CHEMBL1782531 | trans-7-(4-aminocyclohexylamino)-5...)
Affinity DataIC50: >1.00E+4nM. Assay description: Inhibition of CYP3A4 in human liver microsomes
In DepthDetails ArticlePubMed
TargetCytochrome P450 2C19(Homo sapiens (Human))
Genzyme
Curated by ChEMBL
LigandPNGBDBM50345260(CHEMBL1782531 | trans-7-(4-aminocyclohexylamino)-5...)
Affinity DataIC50: >1.00E+4nM. Assay description: Inhibition of CYP2C19 in human liver microsomes
In DepthDetails ArticlePubMed
TargetCytochrome P450 2D6(Homo sapiens (Human))
Genzyme
Curated by ChEMBL
LigandPNGBDBM50345260(CHEMBL1782531 | trans-7-(4-aminocyclohexylamino)-5...)
Affinity DataIC50: >1.00E+4nM. Assay description: Inhibition of CYP2D6 in human liver microsomes
In DepthDetails ArticlePubMed
TargetCytochrome P450 2C9(Homo sapiens (Human))
Genzyme
Curated by ChEMBL
LigandPNGBDBM50345260(CHEMBL1782531 | trans-7-(4-aminocyclohexylamino)-5...)
Affinity DataIC50: >1.00E+4nM. Assay description: Inhibition of CYP2C9 in human liver microsomes
In DepthDetails ArticlePubMed