BDBM50345872 CHEMBL1783668::isobutyl 4-(3-((3-amino-6-chloropyrazin-2-yl)methyl)thioureido)phenyl(phenyl)carbamate
SMILES CC(C)COC(=O)N(c1ccccc1)c1ccc(NC(=S)NCc2nc(Cl)cnc2N)cc1
InChI Key InChIKey=LSVNWNAWSWKXBH-UHFFFAOYSA-N
Data  1 IC50
  Tab Delimited (TSV)   2D SDfile   Computed 3D by Vconf -m prep SDfile
Find this compound or compounds like it in BindingDB:
Activity Spreadsheet -- Enzyme Inhibition Constant Data from BindingDB
Found 1 hit for monomerid = 50345872
TargetMAP kinase-activated protein kinase 2(Homo sapiens (Human))
Merck Research Laboratories
Curated by ChEMBL
LigandPNGBDBM50345872(CHEMBL1783668 | isobutyl 4-(3-((3-amino-6-chloropy...)
Affinity DataIC50:  1.50E+3nM. Assay description: Inhibition of MK2 using biotin-LCAYSRALSRQLSSGVSEIRH substrate
In DepthDetails ArticlePubMed