BDBM50347455 CHEMBL1802188
SMILES COC(=O)c1ccc(cc1)-c1ccc(O[C@H]2O[C@H](CO)[C@@H](O)[C@H](O)[C@@H]2O)cc1Cl
InChI Key InChIKey=ZMJKGQUTBTUUJI-JGLNRKDHSA-N
Data  2 IC50
  Tab Delimited (TSV)   2D SDfile   Computed 3D by Vconf -m prep SDfile
Find this compound or compounds like it in BindingDB:
Activity Spreadsheet -- Enzyme Inhibition Constant Data from BindingDB
Found 2 hits for monomerid = 50347455
TargetType 1 fimbiral adhesin FimH(Escherichia coli (strain UTI89 / UPEC))
University Of Basel
Curated by ChEMBL
LigandPNGBDBM50347455(CHEMBL1802188)
Affinity DataIC50:  4.10E+4nM. Assay description: Antagonist activity at Escherichia coli UT189 FimH in guinea pig red blood cells assessed as disaggregation of bacteria after 600 secs by aggregometr...
In DepthDetails ArticlePubMed
TargetType 1 fimbrin D-mannose specific adhesin(Escherichia coli (strain K12))
University Of Basel
Curated by ChEMBL
LigandPNGBDBM50347455(CHEMBL1802188)
Affinity DataIC50:  22nM. Assay description: Competitive inhibition of His-tagged FimH carbohydrate recognizing domain expressed in Escherichia coli HM125 using ABTS-substrate after 3 hrs by cal...
In DepthDetails ArticlePubMed