BDBM50347462 CHEMBL1802184
SMILES OC[C@H]1O[C@H](OCCCc2ccccc2)[C@@H](O)[C@@H](O)[C@@H]1O
InChI Key InChIKey=QHNJVZUXAYIKTA-MRLBHPIUSA-N
Data  1 IC50
  Tab Delimited (TSV)   2D SDfile   Computed 3D by Vconf -m prep SDfile
Find this compound or compounds like it in BindingDB:
Activity Spreadsheet -- Enzyme Inhibition Constant Data from BindingDB
Found 1 hit for monomerid = 50347462
TargetType 1 fimbrin D-mannose specific adhesin(Escherichia coli (strain K12))
University Of Basel
Curated by ChEMBL
LigandPNGBDBM50347462(CHEMBL1802184)
Affinity DataIC50:  253nM. Assay description: Competitive inhibition of His-tagged FimH carbohydrate recognizing domain expressed in Escherichia coli HM125 using ABTS-substrate after 3 hrs by cal...
In DepthDetails ArticlePubMed