BDBM50347500 CHEMBL1802336::hsp90_5
SMILES Oc1ccc(O)c(c1)-n1c2ccccc2[nH]c1=O
InChI Key InChIKey=YQNAPFSOVYPMMG-UHFFFAOYSA-N
Data  3 IC50
  Tab Delimited (TSV)   2D SDfile   Computed 3D by Vconf -m prep SDfile
Find this compound or compounds like it in BindingDB:
Activity Spreadsheet -- Enzyme Inhibition Constant Data from BindingDB
Found 3 hits for monomerid = 50347500
TargetHeat shock protein HSP 90-beta(Homo sapiens (Human))
D3R/Abbott
LigandPNGBDBM50347500(CHEMBL1802336 | hsp90_5)
Affinity DataIC50:  3.49E+4nM. Assay description: FRET Assay 1
In DepthDetails PubMed
TargetHeat shock protein HSP 90-alpha(Homo sapiens (Human))
Abbott Laboratories
Curated by ChEMBL
LigandPNGBDBM50347500(CHEMBL1802336 | hsp90_5)
Affinity DataIC50:  2.00E+5nM. Assay description: Inhibition of Hsp90alpha ATPase activity by malachite green ATP-ase assay
In DepthDetails ArticlePubMed
TargetHeat shock protein HSP 90-alpha(Homo sapiens (Human))
Abbott Laboratories
Curated by ChEMBL
LigandPNGBDBM50347500(CHEMBL1802336 | hsp90_5)
Affinity DataIC50:  3.49E+4nM. Assay description: Binding affinity to Hsp90alpha N-terminal ATPase domain by TR-FRET assay based competitive binding assay
In DepthDetails ArticlePubMed