BDBM50347505 CHEMBL1801573::hsp90_31
SMILES Oc1cc(O)c(cc1Cl)-n1c2ccc(CNC(=O)c3ccccc3)cc2[nH]c1=O
InChI Key InChIKey=JRHNMIKIHWAFJN-UHFFFAOYSA-N
Data  3 IC50
  Tab Delimited (TSV)   2D SDfile   Computed 3D by Vconf -m prep SDfile
Find this compound or compounds like it in BindingDB:
Activity Spreadsheet -- Enzyme Inhibition Constant Data from BindingDB
Found 3 hits for monomerid = 50347505
TargetHeat shock protein HSP 90-beta(Homo sapiens (Human))
D3R/Abbott
LigandPNGBDBM50347505(CHEMBL1801573 | hsp90_31)
Affinity DataIC50:  72.1nM. Assay description: FRET Assay 1
In DepthDetails PubMed
TargetHeat shock protein HSP 90-alpha(Homo sapiens (Human))
Abbott Laboratories
Curated by ChEMBL
LigandPNGBDBM50347505(CHEMBL1801573 | hsp90_31)
Affinity DataIC50:  2.29E+4nM. Assay description: Inhibition of Hsp90alpha ATPase activity by malachite green ATP-ase assay
In DepthDetails ArticlePubMed
TargetHeat shock protein HSP 90-alpha(Homo sapiens (Human))
Abbott Laboratories
Curated by ChEMBL
LigandPNGBDBM50347505(CHEMBL1801573 | hsp90_31)
Affinity DataIC50:  72nM. Assay description: Binding affinity to Hsp90alpha N-terminal ATPase domain by TR-FRET assay based competitive binding assay
In DepthDetails ArticlePubMed