BDBM50347552 CHEMBL391125
SMILES Oc1c(I)cc(I)cc1C(=O)Nc1ccc(Br)cc1
InChI Key InChIKey=RNHXQTWGVSBLIB-UHFFFAOYSA-N
Data  1 IC50
  Tab Delimited (TSV)   2D SDfile   Computed 3D by Vconf -m prep SDfile
Find this compound or compounds like it in BindingDB:
Activity Spreadsheet -- Enzyme Inhibition Constant Data from BindingDB
Found 1 hit for monomerid = 50347552
TargetChitinase(Onchocerca volvulus)
The Skaggs Institute For Chemical Biology
Curated by ChEMBL
LigandPNGBDBM50347552(CHEMBL391125)
Affinity DataIC50:  680nM. Assay description: Inhibition of Onchocerca volvulus L3 larvae chitinase using 4-methylumbelliferyl-N,N',N''-beta-chitotrioside as a profluorescent substrate after 10 m...
In DepthDetails ArticlePubMed