BDBM50350450 CHEMBL1814335
SMILES CCOC(=O)c1c(nn(c1-c1ccc(Cl)cc1)-c1ccc(Cl)cc1Cl)C(=O)NC1(CC1)c1noc(n1)C(F)(F)F
InChI Key InChIKey=PMTPGJNISXZFDH-UHFFFAOYSA-N
Data  1 IC50
  Tab Delimited (TSV)   2D SDfile   Computed 3D by Vconf -m prep SDfile
Find this compound or compounds like it in BindingDB:
Activity Spreadsheet -- Enzyme Inhibition Constant Data from BindingDB
Found 1 hit for monomerid = 50350450
TargetCannabinoid receptor 1(Rattus norvegicus (rat))
Dr. Reddy'S Laboratories
Curated by ChEMBL
LigandPNGBDBM50350450(CHEMBL1814335)
Affinity DataIC50:  1nMpH: 7.4Assay Description:Displacement of [3H]SR141716A from rat brain CB1 receptor at pH 7.4 after 1 hr by liquid scintillation counting
In DepthDetails ArticlePubMed