BDBM50354029 CHEMBL1830525
SMILES CCC(CC)n1ccc2c(Nc3ccc(Cl)cc3CC)nc3ccnn3c12
InChI Key InChIKey=UMMMHPGCVORHON-UHFFFAOYSA-N
Data  1 IC50  1 EC50
  Tab Delimited (TSV)   2D SDfile   Computed 3D by Vconf -m prep SDfile
Find this compound or compounds like it in BindingDB:
Activity Spreadsheet -- Enzyme Inhibition Constant Data from BindingDB
Found 2 hits for monomerid = 50354029
TargetCorticotropin-releasing factor receptor 1(Homo sapiens (Human))
Minase Research Institute
Curated by ChEMBL
LigandPNGBDBM50354029(CHEMBL1830525)
Affinity DataEC50:  3.90nM. Assay description: Antagonist activity at human CRF1 receptor expressed in CHO-K1 cells assessed as inhibition of CRF-induced cAMP accumulation after 15 mins by cAMP en...
In DepthDetails ArticlePubMed
TargetCorticotropin-releasing factor receptor 1(Homo sapiens (Human))
Minase Research Institute
Curated by ChEMBL
LigandPNGBDBM50354029(CHEMBL1830525)
Affinity DataIC50:  4.70nM. Assay description: Displacement of [125I]-CRF from human CRF1 receptor expressed in CHO-K1 cells after 2 hrs by gamma counting
In DepthDetails ArticlePubMed