BDBM50354030 CHEMBL1830526
SMILES CCC(CC)n1ccc2c(Cc3c(C)cc(C)cc3C)nc3ccnn3c12
InChI Key InChIKey=STZUQSKHHQPAIP-UHFFFAOYSA-N
Data  1 IC50  1 EC50
  Tab Delimited (TSV)   2D SDfile   Computed 3D by Vconf -m prep SDfile
Find this compound or compounds like it in BindingDB:
Activity Spreadsheet -- Enzyme Inhibition Constant Data from BindingDB
Found 2 hits for monomerid = 50354030
TargetCorticotropin-releasing factor receptor 1(Homo sapiens (Human))
Minase Research Institute
Curated by ChEMBL
LigandPNGBDBM50354030(CHEMBL1830526)
Affinity DataEC50:  32.2nM. Assay description: Antagonist activity at human CRF1 receptor expressed in CHO-K1 cells assessed as inhibition of CRF-induced cAMP accumulation after 15 mins by cAMP en...
In DepthDetails ArticlePubMed
TargetCorticotropin-releasing factor receptor 1(Homo sapiens (Human))
Minase Research Institute
Curated by ChEMBL
LigandPNGBDBM50354030(CHEMBL1830526)
Affinity DataIC50:  7.10nM. Assay description: Displacement of [125I]-CRF from human CRF1 receptor expressed in CHO-K1 cells after 2 hrs by gamma counting
In DepthDetails ArticlePubMed