BDBM50354520 CHEMBL1836857
SMILES Fc1ccc2C(CCCCN3CCN(CC3)c3cccc(Cl)c3)C(=O)Nc2c1
InChI Key InChIKey=FMLRXMFPOCCESX-UHFFFAOYSA-N
Data  4 KI
  Tab Delimited (TSV)   2D SDfile   Computed 3D by Vconf -m prep SDfile
Find this compound or compounds like it in BindingDB:
Activity Spreadsheet -- Enzyme Inhibition Constant Data from BindingDB
Found 4 hits for monomerid = 50354520
Target5-hydroxytryptamine receptor 1A(Homo sapiens (Human))
Universit£
Curated by ChEMBL
LigandPNGBDBM50354520(CHEMBL1836857)
Affinity DataKi:  6.70nM. Assay description: Displacement of [3H]8-OH-DPAT from human 5-HT1A receptor transfected in CFO-K1 cells after 30 mins by liquid scintillation spectrometry
In DepthDetails ArticlePubMed
Target5-hydroxytryptamine receptor 7(Homo sapiens (Human))
Egis Pharmaceuticals
Curated by ChEMBL
LigandPNGBDBM50354520(CHEMBL1836857)
Affinity DataKi:  6.70nM. Assay description: Displacement of [3H]CT from human 5-HT7 receptor expressed in CHO cells by scintillation spectrometry
In DepthDetails ArticlePubMed
Target5-hydroxytryptamine receptor 1A(Rattus norvegicus (rat))
Egis Pharmaceuticals
Curated by ChEMBL
LigandPNGBDBM50354520(CHEMBL1836857)
Affinity DataKi:  118nM. Assay description: Displacement of [3H]8-OH-DPAT from 5-HT1A receptor in rat frontal cortex membrane after 45 mins by scintillation counting
In DepthDetails ArticlePubMed
Target5-hydroxytryptamine receptor 7(Homo sapiens (Human))
Egis Pharmaceuticals
Curated by ChEMBL
LigandPNGBDBM50354520(CHEMBL1836857)
Affinity DataKi:  118nM. Assay description: Displacement of [3H]5-HT from human 5HT7 receptor transfected in CFO-K1 cells after 30 mins by liquid scintillation spectrometry
In DepthDetails ArticlePubMed