BDBM50355067 CHEMBL1835763
SMILES Cc1nn(-c2ccc(cc2)C(=O)N[C@@H]2CCCc3cc(CN4CCCCC4)ccc23)c(=O)c2ccccc12
InChI Key InChIKey=NOMAJLSWAKZQQU-SSEXGKCCSA-N
Data  1 KI
  Tab Delimited (TSV)   2D SDfile   Computed 3D by Vconf -m prep SDfile
Find this compound or compounds like it in BindingDB:
Activity Spreadsheet -- Enzyme Inhibition Constant Data from BindingDB
Found 1 hit for monomerid = 50355067
TargetB1 bradykinin receptor(Homo sapiens (Human))
Amgen
Curated by ChEMBL
LigandPNGBDBM50355067(CHEMBL1835763)
Affinity DataKi:  35nM. Assay description: Antagonist activity at human B1 receptor
In DepthDetails ArticlePubMed