BDBM50355068 CHEMBL1835766
SMILES O=C(N[C@@H]1CCCc2cc(CN3CCCCC3)ccc12)c1ccc(cc1)-n1ncc2ccccc2c1=O
InChI Key InChIKey=BUJGZRIHAKBHJI-GDLZYMKVSA-N
Data  1 KI
  Tab Delimited (TSV)   2D SDfile   Computed 3D by Vconf -m prep SDfile
Find this compound or compounds like it in BindingDB:
Activity Spreadsheet -- Enzyme Inhibition Constant Data from BindingDB
Found 1 hit for monomerid = 50355068
TargetB1 bradykinin receptor(Homo sapiens (Human))
Amgen
Curated by ChEMBL
LigandPNGBDBM50355068(CHEMBL1835766)
Affinity DataKi:  52nM. Assay description: Antagonist activity at human B1 receptor
In DepthDetails ArticlePubMed