BDBM50359469 CHEMBL1926882
SMILES COc1cccc(CN(C2CCN(CC2)C(C)CCNC(=O)c2c(Cl)cncc2Cl)c2ccc(Br)cc2)c1
InChI Key InChIKey=WKCUCNKLVWTUOU-UHFFFAOYSA-N
Data  1 IC50
  Tab Delimited (TSV)   2D SDfile   Computed 3D by Vconf -m prep SDfile
Find this compound or compounds like it in BindingDB:
Activity Spreadsheet -- Enzyme Inhibition Constant Data from BindingDB
Found 1 hit for monomerid = 50359469
TargetC-C chemokine receptor type 5(Homo sapiens (Human))
Genzyme
Curated by ChEMBL
LigandPNGBDBM50359469(CHEMBL1926882)
Affinity DataIC50:  387nM. Assay description: Antagonist activity against human CCR5 assessed as inhibition of HIV1 gp120-induced cell-cell fusion between human HeLa P4/R5 cells and CHO-tat10 cel...
In DepthDetails ArticlePubMed