BDBM50359471 CHEMBL1926878
SMILES CC(CCNC(=O)c1c(Cl)cncc1Cl)N1CCC(CC1)N(Cc1ccccc1)c1ccc(Oc2ccc(cc2)C(O)=O)cc1
InChI Key InChIKey=GAZVPCRVUAJMJO-UHFFFAOYSA-N
Data  1 IC50
  Tab Delimited (TSV)   2D SDfile   Computed 3D by Vconf -m prep SDfile
Find this compound or compounds like it in BindingDB:
Activity Spreadsheet -- Enzyme Inhibition Constant Data from BindingDB
Found 1 hit for monomerid = 50359471
TargetC-C chemokine receptor type 5(Homo sapiens (Human))
Genzyme
Curated by ChEMBL
LigandPNGBDBM50359471(CHEMBL1926878)
Affinity DataIC50:  11nM. Assay description: Antagonist activity against human CCR5 assessed as inhibition of HIV1 gp120-induced cell-cell fusion between human HeLa P4/R5 cells and CHO-tat10 cel...
In DepthDetails ArticlePubMed