BDBM50359486 CHEMBL1926894
SMILES COc1ccc(cc1)N(Cc1cccnc1)C1CCN(CC1)[C@H](C)CCNC(=O)c1c(C)cc(Cl)nc1C
InChI Key InChIKey=FGTHTYXSQHJSPI-JOCHJYFZSA-N
Data  1 IC50
  Tab Delimited (TSV)   2D SDfile   Computed 3D by Vconf -m prep SDfile
Find this compound or compounds like it in BindingDB:
Activity Spreadsheet -- Enzyme Inhibition Constant Data from BindingDB
Found 1 hit for monomerid = 50359486
TargetC-C chemokine receptor type 5(Homo sapiens (Human))
Genzyme
Curated by ChEMBL
LigandPNGBDBM50359486(CHEMBL1926894)
Affinity DataIC50:  1.5nM. Assay description: Antagonist activity against human CCR5 assessed as inhibition of HIV1 gp120-induced cell-cell fusion between human HeLa P4/R5 cells and CHO-tat10 cel...
In DepthDetails ArticlePubMed