BDBM50360164 CHEMBL1929531
SMILES CCc1cccc(C[C@H](O)\C=C\[C@H]2COC(=O)N2CCSCCCC(O)=O)c1
InChI Key InChIKey=IRIPWGCQFPPQHK-WARJXXDVSA-N
Data  4 KI  1 EC50
  Tab Delimited (TSV)   2D SDfile   Computed 3D by Vconf -m prep SDfile
Find this compound or compounds like it in BindingDB:
Activity Spreadsheet -- Enzyme Inhibition Constant Data from BindingDB
Found 1 hit for monomerid = 50360164
TargetProstaglandin E2 receptor EP4 subtype(Rattus norvegicus)
Minase Research Institute
Curated by ChEMBL
LigandPNGBDBM50360164(CHEMBL1929531)
Affinity DataEC50:  18nM. Assay description: Agonist activity at rat EP4 receptor expressed in CHO cells assessed as cAMP production after 10 mins by radioimmunoassayChecked by Author
In DepthDetails ArticlePubMed