BDBM50362025 CHEMBL1939886
SMILES OC[C@H](O)C(=O)C(=O)C(F)(F)F
InChI Key InChIKey=DOCCRHSQUNVFRL-REOHCLBHSA-N
Data  1 EC50
  Tab Delimited (TSV)   2D SDfile   Computed 3D by Vconf -m prep SDfile
Find this compound or compounds like it in BindingDB:
Activity Spreadsheet -- Enzyme Inhibition Constant Data from BindingDB
Found 1 hit for monomerid = 50362025
TargetAutoinducer 2-binding periplasmic protein LuxP(Vibrio harveyi)
Instituto De Tecnologia Qu£Mica E Biol£Gica
Curated by ChEMBL
LigandPNGBDBM50362025(CHEMBL1939886)
Affinity DataEC50:  3.00E+4nM. Assay description: Agonist activity at Vibrio harveyi LuxP receptor
In DepthDetails ArticlePubMed