BDBM50363341 CHEMBL1946026
SMILES O=[#6](-[#7]-1-[#6]-[#6]-[#6]-[#6]-1)-c1ccc(cc1)-[#6](=[#6]-1/[#6]-[#6]-[#7](-[#6]-c2cscn2)-[#6]-[#6]-1)\c1cccc2cccnc12
InChI Key InChIKey=CNYAJGPNURAWNB-UHFFFAOYSA-N
Data  2 IC50
  Tab Delimited (TSV)   2D SDfile   Computed 3D by Vconf -m prep SDfile
Find this compound or compounds like it in BindingDB:
Activity Spreadsheet -- Enzyme Inhibition Constant Data from BindingDB
Found 2 hits for monomerid = 50363341
TargetMu-type opioid receptor(Homo sapiens (Human))
Astrazeneca Pharmaceuticals
Curated by ChEMBL
LigandPNGBDBM50363341(CHEMBL1946026)
Affinity DataIC50:  140nM. Assay description: Displacement of radiolabeled FK33-824 from mu opioid receptor expressed in HEK293 cell membranes
In DepthDetails ArticlePubMed
TargetDelta-type opioid receptor(Homo sapiens (Human))
Astrazeneca Pharmaceuticals
Curated by ChEMBL
LigandPNGBDBM50363341(CHEMBL1946026)
Affinity DataIC50:  0.200nM. Assay description: Displacement of radiolabeled iodinated deltorphin 2 from delta opioid receptor expressed in HEK293 cell membranes
In DepthDetails ArticlePubMed