BDBM50365221 CHEMBL1956472
SMILES CCOc1nc2nc(C)cc(Nc3ccc(cc3)C(F)(F)F)n2n1
InChI Key InChIKey=SNTNVQYCKZKZOP-UHFFFAOYSA-N
Data  1 IC50
  Tab Delimited (TSV)   2D SDfile   Computed 3D by Vconf -m prep SDfile
Find this compound or compounds like it in BindingDB:
Activity Spreadsheet -- Enzyme Inhibition Constant Data from BindingDB
Found 1 hit for monomerid = 50365221
TargetDihydroorotate dehydrogenase (quinone), mitochondrial(Homo sapiens (Human))
Glaxosmithkline
Curated by ChEMBL
LigandPNGBDBM50365221(CHEMBL1956472)
Affinity DataIC50: >1.00E+5nM. Assay description: Inhibition of human C-terminal hexa-His tagged DHODH expressed in Escherichia coli by DCIP reduction assay
In DepthDetails ArticlePubMed