BDBM50366388 NEOMYCIN::NEOMYCIN A
SMILES NCC1O[C@@H](O[C@@H]2[C@@H](CO)O[C@@H](O[C@H]3[C@H](O)[C@@H](N)C[C@@H](N)[C@@H]3O[C@H]3O[C@H](CN)[C@@H](O)[C@H](O)[C@H]3N)[C@@H]2O)[C@@H](N)[C@H](O)[C@H]1O
InChI Key InChIKey=PGBHMTALBVVCIT-DPNHOFNISA-N
Data  1 IC50  1 Kd
  Tab Delimited (TSV)   2D SDfile   Computed 3D by Vconf -m prep SDfile
Find this compound or compounds like it in BindingDB:
Activity Spreadsheet -- Enzyme Inhibition Constant Data from BindingDB
Found 1 hit for monomerid = 50366388
TargetMenin(Homo sapiens (Human))
Fuzhou University
Curated by ChEMBL
LigandPNGBDBM50366388(NEOMYCIN | NEOMYCIN A)
Affinity DataKd:  1.56E+4nM. Assay description: Binding affinity to menin (unknown origin) by isothermal titration calorimetry analysis
In DepthDetails ArticlePubMed