BDBM50367356 CHEMBL1202532
SMILES O=C1CC2(CCc3ccccc3C2)C(=O)N1CCCCN1CCN(CC1)c1ncccn1
InChI Key InChIKey=YLIUOKCBMMVWDS-UHFFFAOYSA-N
Data  1 IC50
  Tab Delimited (TSV)   2D SDfile   Computed 3D by Vconf -m prep SDfile
Find this compound or compounds like it in BindingDB:
Activity Spreadsheet -- Enzyme Inhibition Constant Data from BindingDB
Found 1 hit for monomerid = 50367356
TargetD(2) dopamine receptor(Rattus norvegicus (rat))
TBA
Curated by ChEMBL
LigandPNGBDBM50367356(CHEMBL1202532)
Affinity DataIC50:  540nM. Assay description: Binding affinity at Dopamine receptor D2 in rat corpus striatum by displacing [3H]-spiperone.
In DepthDetails ArticlePubMed