BDBM50367854 CHEMBL4164483
SMILES Cn1cccc(-c2ccc(cc2)N([C@H]2CC[C@@H](CC2)Nc2ccc(cn2)C#N)C(=O)NCc2ccccc2)c1=O
InChI Key InChIKey=ZULSMIQPZXUJHT-FBSWEULCSA-N
Data  3 IC50
  Tab Delimited (TSV)   2D SDfile   Computed 3D by Vconf -m prep SDfile
Find this compound or compounds like it in BindingDB:
Activity Spreadsheet -- Enzyme Inhibition Constant Data from BindingDB
Found 3 hits for monomerid = 50367854
TargetCyclin-dependent kinase 12(Homo sapiens)
Takeda Pharmaceutical
Curated by ChEMBL
LigandPNGBDBM50367854(CHEMBL4164483)
Affinity DataIC50:  250nM. Assay description: Inhibition of N-terminal FLAG-tagged human full-length CDK12 (1 to 1490 residues)/N-terminal His-tagged CycK (1 to 580 residues) expressed in Sf9 cel...
In DepthDetails ArticlePubMed
TargetCyclin-T1/Cyclin-dependent kinase 9(Homo sapiens (Human))
Takeda Pharmaceutical
Curated by ChEMBL
LigandPNGBDBM50367854(CHEMBL4164483)
Affinity DataIC50:  1.50E+4nM. Assay description: Inhibition of GST-tagged human CDK9/CycT1 (04 to 110 residues) assessed as reduction in ATP-dependent ULight-4E-BP1 (Thr37/Thr46) substrate peptide p...
In DepthDetails ArticlePubMed
TargetCyclin-A2/Cyclin-dependent kinase 2(Homo sapiens (Human))
Takeda Pharmaceutical
Curated by ChEMBL
LigandPNGBDBM50367854(CHEMBL4164483)
Affinity DataIC50:  1.80E+4nM. Assay description: Inhibition of GST-tagged human CDK2/CCNA2 (04 to 103 residues) pre-incubated for 5 mins before addition of histone H1 substrate and [gamma-33P]ATP an...
In DepthDetails ArticlePubMed