BDBM50368146 CS-514::Eptastatin Sodium::PRAVASTATIN SODIUM::Pravachol::Pravastatin
SMILES CC[C@H](C)C(=O)O[C@H]1C[C@H](O)C=C2C=C[C@H](C)[C@H](CC[C@@H](O)C[C@@H](O)CC([O-])=O)[C@@H]12
InChI Key InChIKey=TUZYXOIXSAXUGO-PZAWKZKUSA-M
Data  6 IC50
  Tab Delimited (TSV)   2D SDfile   Computed 3D by Vconf -m prep SDfile
Find this compound or compounds like it in BindingDB:
Activity Spreadsheet -- Enzyme Inhibition Constant Data from BindingDB
Found 6 hits for monomerid = 50368146
Target3-hydroxy-3-methylglutaryl-coenzyme A reductase(Homo sapiens (Human))
Warner-Lambert
Curated by ChEMBL
LigandPNGBDBM50368146(CS-514 | Eptastatin Sodium | PRAVASTATIN SODIUM | ...)
Affinity DataIC50:  30nM. Assay description: Tested in vitro for the inhibition of HMG-CoA reductase from partially purified microsomal preparations.
In DepthDetails ArticlePubMed
Target3-hydroxy-3-methylglutaryl-coenzyme A reductase(Rattus norvegicus (rat))
Warner-Lambert
Curated by ChEMBL
LigandPNGBDBM50368146(CS-514 | Eptastatin Sodium | PRAVASTATIN SODIUM | ...)
Affinity DataIC50:  40nM. Assay description: Ability to inhibit microsomal preparation of HMG-CoA reductase in rat liver.
In DepthDetails ArticlePubMed
TargetBile salt export pump(Homo sapiens (Human))
Amgen
Curated by ChEMBL
LigandPNGBDBM50368146(CS-514 | Eptastatin Sodium | PRAVASTATIN SODIUM | ...)
Affinity DataIC50: >1.33E+5nM. Assay description: Inhibition of human BSEP overexpressed in Sf9 cell membrane vesicles assessed as uptake of [3H]-taurocholate in presence of ATP measured after 15 to ...
In DepthDetails ArticlePubMed
TargetATP-binding cassette sub-family C member 2(Homo sapiens (Human))
Amgen
Curated by ChEMBL
LigandPNGBDBM50368146(CS-514 | Eptastatin Sodium | PRAVASTATIN SODIUM | ...)
Affinity DataIC50: >1.33E+5nM. Assay description: Inhibition of human MRP2 overexpressed in Sf9 cell membrane vesicles assessed as uptake of [3H]-estradiol-17beta-D-glucuronide in presence of ATP and...
In DepthDetails ArticlePubMed
TargetATP-binding cassette sub-family C member 4(Homo sapiens (Human))
Amgen
Curated by ChEMBL
LigandPNGBDBM50368146(CS-514 | Eptastatin Sodium | PRAVASTATIN SODIUM | ...)
Affinity DataIC50: >1.33E+5nM. Assay description: Inhibition of human MRP4 overexpressed in Sf9 cell membrane vesicles assessed as uptake of [3H]-estradiol-17beta-D-glucuronide in presence of ATP and...
In DepthDetails ArticlePubMed
TargetATP-binding cassette sub-family C member 3(Homo sapiens (Human))
Amgen
Curated by ChEMBL
LigandPNGBDBM50368146(CS-514 | Eptastatin Sodium | PRAVASTATIN SODIUM | ...)
Affinity DataIC50:  1.25E+5nM. Assay description: Inhibition of human MRP3 overexpressed in Sf9 insect cell membrane vesicles assessed as uptake of [3H]-estradiol-17beta-D-glucuronide in presence of ...
In DepthDetails ArticlePubMed