BDBM50368335 CHEMBL4172063
SMILES [O-][N+](=O)c1ccc2nc(nc(Nc3cccc(F)c3)c2c1)-c1ccccc1
InChI Key InChIKey=HKFMMGIVIGHLPW-UHFFFAOYSA-N
Data  1 IC50
  Tab Delimited (TSV)   2D SDfile   Computed 3D by Vconf -m prep SDfile
Find this compound or compounds like it in BindingDB:
Activity Spreadsheet -- Enzyme Inhibition Constant Data from BindingDB
Found 1 hit for monomerid = 50368335
TargetBroad substrate specificity ATP-binding cassette transporter ABCG2(Homo sapiens (Human))
University Of Bonn
Curated by ChEMBL
LigandPNGBDBM50368335(CHEMBL4172063)
Affinity DataIC50:  52nM. Assay description: Inhibition of c-terminal GFP-tagged human ABCG2 expressed in MDCK2 cells preincubated for 30 mins before Hoechst 33342 addition by Hoechst 33342 accu...
In DepthDetails ArticlePubMed