BDBM50368353 CHEMBL4166754
SMILES Oc1ccc(Nc2nc(nc3ccc(cc23)[N+]([O-])=O)-c2cccc(c2)C(F)(F)F)cc1[N+]([O-])=O
InChI Key InChIKey=FSNCBCISRCCRAI-UHFFFAOYSA-N
Data  1 IC50  1 EC50
  Tab Delimited (TSV)   2D SDfile   Computed 3D by Vconf -m prep SDfile
Find this compound or compounds like it in BindingDB:
Activity Spreadsheet -- Enzyme Inhibition Constant Data from BindingDB
Found 2 hits for monomerid = 50368353
TargetBroad substrate specificity ATP-binding cassette transporter ABCG2(Homo sapiens (Human))
University Of Bonn
Curated by ChEMBL
LigandPNGBDBM50368353(CHEMBL4166754)
Affinity DataEC50:  57nM. Assay description: Inhibition of c-terminal GFP-tagged human ABCG2 expressed in MDCK2 cells overexpressing BCRP assessed as enhancement of SN-38-induced cytotoxicity in...
In DepthDetails ArticlePubMed
TargetBroad substrate specificity ATP-binding cassette transporter ABCG2(Homo sapiens (Human))
University Of Bonn
Curated by ChEMBL
LigandPNGBDBM50368353(CHEMBL4166754)
Affinity DataIC50:  33nM. Assay description: Inhibition of c-terminal GFP-tagged human ABCG2 expressed in MDCK2 cells preincubated for 30 mins before Hoechst 33342 addition by Hoechst 33342 accu...
In DepthDetails ArticlePubMed