BDBM50368360 CHEMBL4174654
SMILES [O-][N+](=O)c1ccc(Nc2nc(nc3ccc(cc23)[N+]([O-])=O)-c2cccc(c2)C(F)(F)F)cc1
InChI Key InChIKey=DSZOFJXPHBIQQF-UHFFFAOYSA-N
Data  1 IC50
  Tab Delimited (TSV)   2D SDfile   Computed 3D by Vconf -m prep SDfile
Find this compound or compounds like it in BindingDB:
Activity Spreadsheet -- Enzyme Inhibition Constant Data from BindingDB
Found 1 hit for monomerid = 50368360
TargetBroad substrate specificity ATP-binding cassette transporter ABCG2(Homo sapiens (Human))
University Of Bonn
Curated by ChEMBL
LigandPNGBDBM50368360(CHEMBL4174654)
Affinity DataIC50:  61nM. Assay description: Inhibition of c-terminal GFP-tagged human ABCG2 expressed in MDCK2 cells preincubated for 30 mins before Hoechst 33342 addition by Hoechst 33342 accu...
In DepthDetails ArticlePubMed