BDBM50368364 CHEMBL4159686
SMILES [O-][N+](=O)c1ccc2nc(nc(Nc3cccc(c3)C#N)c2c1)-c1ccncc1
InChI Key InChIKey=UBDOYGVMAGRXTP-UHFFFAOYSA-N
Data  1 IC50  1 EC50
  Tab Delimited (TSV)   2D SDfile   Computed 3D by Vconf -m prep SDfile
Find this compound or compounds like it in BindingDB:
Activity Spreadsheet -- Enzyme Inhibition Constant Data from BindingDB
Found 2 hits for monomerid = 50368364
TargetBroad substrate specificity ATP-binding cassette transporter ABCG2(Homo sapiens (Human))
University Of Bonn
Curated by ChEMBL
LigandPNGBDBM50368364(CHEMBL4159686)
Affinity DataIC50:  64nM. Assay description: Inhibition of c-terminal GFP-tagged human ABCG2 expressed in MDCK2 cells preincubated for 30 mins before Hoechst 33342 addition by Hoechst 33342 accu...
In DepthDetails ArticlePubMed
TargetBroad substrate specificity ATP-binding cassette transporter ABCG2(Homo sapiens (Human))
University Of Bonn
Curated by ChEMBL
LigandPNGBDBM50368364(CHEMBL4159686)
Affinity DataEC50:  48nM. Assay description: Inhibition of c-terminal GFP-tagged human ABCG2 expressed in MDCK2 cells overexpressing BCRP assessed as enhancement of SN-38-induced cytotoxicity in...
In DepthDetails ArticlePubMed