BDBM50368742 CHEMBL1169525
SMILES COc1cc(N)c(Cl)cc1C(=O)N[C@H]1CC2CCCC1N2Cc1ccc(F)cc1
InChI Key InChIKey=KBMHZDMOELXKBL-YHDJDMAPSA-N
Data  3 KI
  Tab Delimited (TSV)   2D SDfile   Computed 3D by Vconf -m prep SDfile
Find this compound or compounds like it in BindingDB:
Activity Spreadsheet -- Enzyme Inhibition Constant Data from BindingDB
Found 3 hits for monomerid = 50368742
TargetD(2) dopamine receptor(Rattus norvegicus (rat))
University Of Pennsylvania
Curated by ChEMBL
LigandPNGBDBM50368742(CHEMBL1169525)
Affinity DataKi:  0.0170nM. Assay description: Inhibition of [125I]- NCQ 298 binding to D2 receptor of rat striatal tissue
In DepthDetails ArticlePubMed
TargetSerotonin 2 (5-HT2) receptor(RAT)
University Of Pennsylvania
Curated by ChEMBL
LigandPNGBDBM50368742(CHEMBL1169525)
Affinity DataKi:  3.70nM. Assay description: In vitro binding affinity on 5-hydroxytryptamine 2 receptor is inhibition of binding of [125I]- I-LSD to P11 cells
In DepthDetails ArticlePubMed
LigandPNGBDBM50368742(CHEMBL1169525)
Affinity DataKi: >1.00E+4nM. Assay description: In vitro binding affinity on alpha-2 receptor is inhibition of binding of [3H]- rauwolscine to rat cortex
In DepthDetails ArticlePubMed