BDBM50369023 CHEMBL1794814
SMILES CN(Cc1cnc([nH]1)-c1cccc(F)c1)Cc1ccccc1
InChI Key InChIKey=POINCCAWLOORMZ-UHFFFAOYSA-N
Data  1 KI
  Tab Delimited (TSV)   2D SDfile   Computed 3D by Vconf -m prep SDfile
Find this compound or compounds like it in BindingDB:
Activity Spreadsheet -- Enzyme Inhibition Constant Data from BindingDB
Found 1 hit for monomerid = 50369023
TargetD(2) dopamine receptor(Cercopithecus aethiops)
Neurogen
Curated by ChEMBL
LigandPNGBDBM50369023(CHEMBL1794814)
Affinity DataKi:  460nM. Assay description: Displacement of [3H]YM-09151 from recombinant African green monkey Dopamine receptor D2
In DepthDetails ArticlePubMed