BDBM50372561 CHEMBL255951
SMILES Cc1cc(C)n(n1)-c1cc(NC(=O)Cc2ccc(CN3CCOCC3)cc2)nc(n1)-c1ccc(C)o1
InChI Key InChIKey=BZWHCCBCMLZMRR-UHFFFAOYSA-N
Data  1 KI
  Tab Delimited (TSV)   2D SDfile   Computed 3D by Vconf -m prep SDfile
Find this compound or compounds like it in BindingDB:
Activity Spreadsheet -- Enzyme Inhibition Constant Data from BindingDB
Found 1 hit for monomerid = 50372561
TargetAdenosine receptor A2a(Homo sapiens (Human))
Neurocrine Biosciences
Curated by ChEMBL
LigandPNGBDBM50372561(CHEMBL255951)
Affinity DataKi:  0.800nM. Assay description: Displacement of [3H]ZM241385 from human adenosine A2A receptor expressed in HEK293 cells
In DepthDetails ArticlePubMed