BDBM50372755 CHEMBL255828
SMILES O=C(Nc1ccc(cc1)C1CCCCC1)C1C(=O)OC(Cc2ccccc2)C1=O
InChI Key InChIKey=OSAPJMWJJQLGLB-UHFFFAOYSA-N
Data  2 IC50
  Tab Delimited (TSV)   2D SDfile   Computed 3D by Vconf -m prep SDfile
Find this compound or compounds like it in BindingDB:
Activity Spreadsheet -- Enzyme Inhibition Constant Data from BindingDB
Found 2 hits for monomerid = 50372755
TargetIsoprenyl transferase(Streptococcus pneumoniae)
Novartis Institutes For Biomedical Research
Curated by ChEMBL
LigandPNGBDBM50372755(CHEMBL255828)
Affinity DataIC50:  500nM. Assay description: Inhibition of Streptococcus pneumoniae UPPS
In DepthDetails ArticlePubMed
TargetFarnesyl pyrophosphate synthase(Homo sapiens (Human))
Novartis Institutes For Biomedical Research
Curated by ChEMBL
LigandPNGBDBM50372755(CHEMBL255828)
Affinity DataIC50: >5.00E+4nM. Assay description: Inhibition of human FPPS
In DepthDetails ArticlePubMed