BDBM50372776 CHEMBL428250
SMILES O=C(Nc1ccc(cc1)C1CCCCC1)C1C(=O)NC(Cc2ncc[nH]2)C1=O
InChI Key InChIKey=PROCPCGEIGHULW-UHFFFAOYSA-N
Data  1 IC50
  Tab Delimited (TSV)   2D SDfile   Computed 3D by Vconf -m prep SDfile
Find this compound or compounds like it in BindingDB:
Activity Spreadsheet -- Enzyme Inhibition Constant Data from BindingDB
Found 1 hit for monomerid = 50372776
TargetIsoprenyl transferase(Streptococcus pneumoniae)
Novartis Institutes For Biomedical Research
Curated by ChEMBL
LigandPNGBDBM50372776(CHEMBL428250)
Affinity DataIC50:  4.20E+3nM. Assay description: Inhibition of Streptococcus pneumoniae UPPS
In DepthDetails ArticlePubMed