BDBM50373492 CHEMBL272602
SMILES Oc1ccccc1N1CCN(Cc2cnn3ccccc23)CC1
InChI Key InChIKey=ALLYNSCMTRSFNH-UHFFFAOYSA-N
Data  5 KI
  Tab Delimited (TSV)   2D SDfile   Computed 3D by Vconf -m prep SDfile
Find this compound or compounds like it in BindingDB:
Activity Spreadsheet -- Enzyme Inhibition Constant Data from BindingDB
Found 5 hits for monomerid = 50373492
Target5-hydroxytryptamine receptor 2A(PIG)
Friedrich-Alexander University
Curated by ChEMBL
LigandPNGBDBM50373492(CHEMBL272602)
Affinity DataKi:  1.50E+3nM. Assay description: Displacement of [3H]ketanserin from 5HT2 receptor in pig cortical membranes
In DepthDetails ArticlePubMed
TargetD(3) dopamine receptor(Homo sapiens (Human))
Friedrich-Alexander University
Curated by ChEMBL
LigandPNGBDBM50373492(CHEMBL272602)
Affinity DataKi:  2.20E+3nM. Assay description: Displacement of [3H]spiperone from cloned human dopamine D3 receptor expressed in CHO cells
In DepthDetails ArticlePubMed
TargetD(1A) dopamine receptor(Sus scrofa)
Friedrich-Alexander University
Curated by ChEMBL
LigandPNGBDBM50373492(CHEMBL272602)
Affinity DataKi:  2.80E+3nM. Assay description: Displacement of [3H]SCH23990 from dopamine D1 receptor in pig striatal membrane
In DepthDetails ArticlePubMed
TargetD(2) dopamine receptor(Homo sapiens (Human))
Friedrich-Alexander University
Curated by ChEMBL
LigandPNGBDBM50373492(CHEMBL272602)
Affinity DataKi:  4.50E+3nM. Assay description: Displacement of [3H]spiperone from cloned human dopamine D2L receptor expressed in CHO cells
In DepthDetails ArticlePubMed
TargetD(2) dopamine receptor(Homo sapiens (Human))
Friedrich-Alexander University
Curated by ChEMBL
LigandPNGBDBM50373492(CHEMBL272602)
Affinity DataKi:  4.70E+3nM. Assay description: Displacement of [3H]spiperone from cloned human dopamine D2S receptor expressed in CHO cells
In DepthDetails ArticlePubMed