BDBM50373498 CHEMBL405292
SMILES Fc1cccc(n1)N1CCN(Cc2cc3ccccn3n2)CC1
InChI Key InChIKey=CECDNRUCUZFOLS-UHFFFAOYSA-N
Data  5 KI
  Tab Delimited (TSV)   2D SDfile   Computed 3D by Vconf -m prep SDfile
Find this compound or compounds like it in BindingDB:
Activity Spreadsheet -- Enzyme Inhibition Constant Data from BindingDB
Found 5 hits for monomerid = 50373498
TargetD(2) dopamine receptor(Homo sapiens (Human))
Friedrich-Alexander University
Curated by ChEMBL
LigandPNGBDBM50373498(CHEMBL405292)
Affinity DataKi:  1.70E+3nM. Assay description: Displacement of [3H]spiperone from cloned human dopamine D2S receptor expressed in CHO cells
In DepthDetails ArticlePubMed
TargetD(2) dopamine receptor(Homo sapiens (Human))
Friedrich-Alexander University
Curated by ChEMBL
LigandPNGBDBM50373498(CHEMBL405292)
Affinity DataKi:  3.40E+3nM. Assay description: Displacement of [3H]spiperone from cloned human dopamine D2L receptor expressed in CHO cells
In DepthDetails ArticlePubMed
TargetD(3) dopamine receptor(Homo sapiens (Human))
Friedrich-Alexander University
Curated by ChEMBL
LigandPNGBDBM50373498(CHEMBL405292)
Affinity DataKi:  3.40E+3nM. Assay description: Displacement of [3H]spiperone from cloned human dopamine D3 receptor expressed in CHO cells
In DepthDetails ArticlePubMed
Target5-hydroxytryptamine receptor 2A(PIG)
Friedrich-Alexander University
Curated by ChEMBL
LigandPNGBDBM50373498(CHEMBL405292)
Affinity DataKi:  9.70E+3nM. Assay description: Displacement of [3H]ketanserin from 5HT2 receptor in pig cortical membranes
In DepthDetails ArticlePubMed
TargetD(1A) dopamine receptor(Sus scrofa)
Friedrich-Alexander University
Curated by ChEMBL
LigandPNGBDBM50373498(CHEMBL405292)
Affinity DataKi:  3.00E+4nM. Assay description: Displacement of [3H]SCH23990 from dopamine D1 receptor in pig striatal membrane
In DepthDetails ArticlePubMed