BDBM50375078 CHEMBL403611
SMILES OCCCc1cn(C2=C(C(=O)NC2=O)c2c[nH]c3ccccc23)c2ccccc12
InChI Key InChIKey=IQPQFHCXXRZPSD-UHFFFAOYSA-N
Data  1 IC50
  Tab Delimited (TSV)   2D SDfile   Computed 3D by Vconf -m prep SDfile
Find this compound or compounds like it in BindingDB:
Activity Spreadsheet -- Enzyme Inhibition Constant Data from BindingDB
Found 1 hit for monomerid = 50375078
LigandPNGBDBM50375078(CHEMBL403611)
Affinity DataIC50:  6.00E+3nM. Assay description: Inhibition of CaMK2delta
In DepthDetails ArticlePubMed