BDBM50375080 CHEMBL270141
SMILES NCCCc1cn(C2=C(C(=O)NC2=O)c2c[nH]c3ccccc23)c2ccccc12
InChI Key InChIKey=RJNHGHQCBFOQKS-UHFFFAOYSA-N
Data  1 IC50
  Tab Delimited (TSV)   2D SDfile   Computed 3D by Vconf -m prep SDfile
Find this compound or compounds like it in BindingDB:
Activity Spreadsheet -- Enzyme Inhibition Constant Data from BindingDB
Found 1 hit for monomerid = 50375080
LigandPNGBDBM50375080(CHEMBL270141)
Affinity DataIC50:  190nM. Assay description: Inhibition of CaMK2delta
In DepthDetails ArticlePubMed