BDBM50375592 CHEMBL412272
SMILES C[C@H](CCC(=O)NCCS(O)(=O)=O)[C@H]1CC[C@H]2[C@@H]3CC[C@@H]4C[C@H](O)CC[C@]4(C)[C@H]3C[C@H](O)[C@]12C
InChI Key InChIKey=AWDRATDZQPNJFN-VAYUFCLWSA-N
Data  1 KI  1 IC50  3 EC50
PDB links: 1 PDB ID matches this monomer.
  Tab Delimited (TSV)   2D SDfile   Computed 3D by Vconf -m prep SDfile
Find this compound or compounds like it in BindingDB:
Activity Spreadsheet -- Enzyme Inhibition Constant Data from BindingDB
Found 5 hits for monomerid = 50375592
TargetIleal sodium/bile acid cotransporter(Homo sapiens (Human))
Wake Forest University
Curated by ChEMBL
LigandPNGBDBM50375592(CHEMBL412272)
Affinity DataKi:  1.72E+4nM. Assay description: TP_TRANSPORTER: inhibition of Taurocholate uptake in ASBT-expressing COS cells
In DepthDetails ArticlePubMed
TargetG-protein coupled bile acid receptor 1(Homo sapiens (Human))
Heinrich Heine University
Curated by ChEMBL
LigandPNGBDBM50375592(CHEMBL412272)
Affinity DataEC50:  680nM. Assay description: Agonist activity at wild type human TGR5 expressed in HEK293 cells assessed as rise in intracellular cAMP level incubated for 16 hrs by luciferase re...
In DepthDetails ArticlePubMed
TargetG-protein coupled bile acid receptor 1(Homo sapiens (Human))
Heinrich Heine University
Curated by ChEMBL
LigandPNGBDBM50375592(CHEMBL412272)
Affinity DataEC50:  8.90E+3nM. Assay description: Agonist activity at human TGR5 Y89A mutant expressed in HEK293 cells assessed as rise in intracellular cAMP level incubated for 16 hrs by luciferase ...
In DepthDetails ArticlePubMed
TargetATP-binding cassette sub-family C member 4(Homo sapiens (Human))
The Netherlands Cancer Institute
Curated by ChEMBL
LigandPNGBDBM50375592(CHEMBL412272)
Affinity DataIC50:  6.00E+4nM. Assay description: TP_TRANSPORTER: inhibition of E217betaG uptake in membrane vesicles from MRP4-expressing HEK-293 cells
In DepthDetails ArticlePubMed
TargetG-protein coupled bile acid receptor 1(Homo sapiens (Human))
Heinrich Heine University
Curated by ChEMBL
LigandPNGBDBM50375592(CHEMBL412272)
Affinity DataEC50:  790nM. Assay description: Agonist activity at human TGR5 expressed in CHO cells by luciferase assay
In DepthDetails ArticlePubMed