BDBM50379016 CHEMBL2011594
SMILES CN1CCN(CC1)c1nc2ccccc2c(C(=O)NCCOCCOCCOCCOCCOCCOCCOCCOCCOCCNC(=O)NCC(O)=O)c1C
InChI Key InChIKey=RZWSWDNYRNUBMS-UHFFFAOYSA-N
Data  1 KI
  Tab Delimited (TSV)   2D SDfile   Computed 3D by Vconf -m prep SDfile
Find this compound or compounds like it in BindingDB:
Activity Spreadsheet -- Enzyme Inhibition Constant Data from BindingDB
Found 1 hit for monomerid = 50379016
Target5-hydroxytryptamine receptor 3A(RAT)
TBA
Curated by ChEMBL
LigandPNGBDBM50379016(CHEMBL2011594)
Affinity DataKi:  154nM. Assay description: Displacement of [3H]granisetron from 5HT3 receptor in Wistar rat cortical membranes by liquid scintillation spectrometery
In DepthDetails ArticlePubMed