BDBM50380693 CHEMBL2017509
SMILES CCOP(=O)(OCC)C(Cc1ccccc1F)c1sc2ccccc2c1C
InChI Key InChIKey=MTNMJYZTAKIWAW-UHFFFAOYSA-N
Data  1 IC50
  Tab Delimited (TSV)   2D SDfile   Computed 3D by Vconf -m prep SDfile
Find this compound or compounds like it in BindingDB:
Activity Spreadsheet -- Enzyme Inhibition Constant Data from BindingDB
Found 1 hit for monomerid = 50380693
TargetTransient receptor potential M8 protein(Canis lupus familiaris (Dog))
Janssen Pharmaceutica
Curated by ChEMBL
LigandPNGBDBM50380693(CHEMBL2017509)
Affinity DataIC50:  114nM. Assay description: Antagonist activity at dog TRPM8 expressed in HEK293 cells assessed as inhibition of icilin-induced increase in intracellular Ca2+ level measured eve...
In DepthDetails ArticlePubMed