BDBM50380876 CHEMBL2018952
SMILES COc1cccc2n(Cc3cccc(c3)C(N)=O)nc(NS(=O)(=O)c3ccc(Cl)s3)c12
InChI Key InChIKey=MLFCJHOGZMGVGN-UHFFFAOYSA-N
Data  1 KI  1 IC50  1 Kd
  Tab Delimited (TSV)   2D SDfile   Computed 3D by Vconf -m prep SDfile
Find this compound or compounds like it in BindingDB:
Activity Spreadsheet -- Enzyme Inhibition Constant Data from BindingDB
Found 3 hits for monomerid = 50380876
TargetC-C chemokine receptor type 4(Homo sapiens (Human))
Glaxosmithkline
Curated by ChEMBL
LigandPNGBDBM50380876(CHEMBL2018952)
Affinity DataKi:  39.8nM. Assay description: Displacement of [125I]TARC from human CCR4 expressed in CHO membranes by SPA
In DepthDetails ArticlePubMed
TargetC-C chemokine receptor type 4(Homo sapiens (Human))
Glaxosmithkline
Curated by ChEMBL
LigandPNGBDBM50380876(CHEMBL2018952)
Affinity DataKd:  1.58E+3nM. Assay description: Antagonist activity at human CCR4 in human whole blood assessed as inhibition of TARC-induced CD4+ CCR4+lymphocyte chemotaxis measuring F-actin conte...
In DepthDetails ArticlePubMed
TargetC-C chemokine receptor type 4(Homo sapiens (Human))
Glaxosmithkline
Curated by ChEMBL
LigandPNGBDBM50380876(CHEMBL2018952)
Affinity DataIC50:  55.0nM. Assay description: Antagonist activity at human CCR4 expressed in CHO membranes assessed as inhibition of [35S]-GTPgammaS binding by scintillation counting
In DepthDetails ArticlePubMed